Target
Endothelial lipase
Ligand
BDBM199223
Substrate
Meas. Tech.
Endothelial Lipase Assay
pH
7.2±n/a
IC50
136±n/a nM
Comments
extracted
Citation
 Connelly, MAGreco, MYe, H Tricyclic indole derivatives useful endothelial lipase inhibitors US Patent  US9216998 Publication Date 12/22/2015 
Target
Name:
Endothelial lipase
Synonyms:
EDL Endothelial lipase LIPE_MOUSE | Lipg
Type:
Protein
Mol. Mass.:
56643.58
Organism:
Mus musculus (Mouse)
Description:
Q9WVG5
Residue:
500
  
Inhibitor
Name:
BDBM199223
Synonyms:
US9216998, 6
Type:
Small organic molecule
Emp. Form.:
C20H18F3NO
Mol. Mass.:
345.3582
SMILES:
Oc1cc2CCCn3c(CCc4ccccc4)c(c(c1)c23)C(F)(F)F
: