Target
Mu-type opioid receptor
Ligand
BDBM199419
Substrate
Meas. Tech.
Radioligand Dose-Displacement Binding Assay
pH
7.4±n/a
Temperature
323.15±n/a K
Ki
0.15±0.05 nM
Comments
extracted
Citation
 Kyle, DJTafesse, L Buprenorphine analogs US Patent  US9221831 Publication Date 12/29/2015 
Target
Name:
Mu-type opioid receptor
Synonyms:
M-OR-1 MOR-1 MUOR1 Mu opiate receptor OPRM1 hMOP | mu-type opioid receptor isoform MOR-1
Type:
G Protein-Coupled Receptor (GPCR)
Mol. Mass.:
44789.51
Organism:
Homo sapiens (Human)
Description:
P35372
Residue:
400
  
Inhibitor
Name:
BDBM199419
Synonyms:
US9221831, 85
Type:
Small organic molecule
Emp. Form.:
C30H42N2O5
Mol. Mass.:
510.6649
SMILES:
CC[C@H](C)[C@H](N)C(=O)OC[C@H]1C[C@]23CC[C@]1(OC)[C@@H]1Oc4c5c(C[C@H]2N(CC2CC2)CC[C@@]315)ccc4O
: