Target
Cyclin-dependent kinase/G2/mitotic-specific cyclin- 1
Ligand
BDBM5725
Substrate
Histone H1
Meas. Tech.
Kinase Inhibition assay
IC50
7±n/a nM
Citation
 Misra, RNXiao, HYWilliams, DKKim, KSLu, SKeller, KAMulheron, JGBatorsky, RTokarski, JSSack, JSKimball, SDLee, FYWebster, KR Synthesis and biological activity of N-aryl-2-aminothiazoles: potent pan inhibitors of cyclin-dependent kinases. Bioorg Med Chem Lett 14:2973-7 (2004)  
Target
Name:
Cyclin-dependent kinase/G2/mitotic-specific cyclin- 1
Synonyms:
CDK1/B CDK1/CyclinB Cyclin-Dependent Kinase 1 (CDK1) Cyclin-dependent kinase/G2/mitotic-specific cyclin 1 | cdk1
Type:
Protein Complex
Mol. Mass.:
Description:
CDK1/Cyclin B complexes were purified from insect cells co-infected with baculovirus vectors containing each of the components.
Components:
This complex has 2 components.
Component 1
Name:
Cyclin-dependent kinase 1
Synonyms:
CDC2 CDK1 CDKN1 Cell division protein kinase 1 P34CDC2 | p34 protein kinase
Type:
Enzyme Subunit
Mol. Mass.:
34101.08
Organism:
Homo sapiens (Human)
Description:
P06493
Residue:
297
  
Component 2
Name:
G2/mitotic-specific cyclin-B1
Synonyms:
CCNB CCNB1_HUMAN
Type:
Enzyme Subunit
Mol. Mass.:
48340.95
Organism:
Homo sapiens (Human)
Description:
P14635
Residue:
433
  
Inhibitor
Name:
BDBM5725
Synonyms:
2-aminothiazole 9 | 5-{[(5-tert-butyl-1,3-oxazol-2-yl)methyl]sulfanyl}-N-(pyrimidin-4-yl)-1,3-thiazol-2-amine
Type:
Small organic molecule
Emp. Form.:
C15H17N5OS2
Mol. Mass.:
347.458
SMILES:
CC(C)(C)c1cnc(CSc2cnc(Nc3ccncn3)s2)o1
:
Substrate
Name:
Histone H1
Synonyms:
Type:
Other Protein Type
Mol. Mass.:
358.43
Organism:
Bos taurus (bovine)
Description:
25 uM ATP/0.2 uCi[gamma-33P] as co-substrate.
Residue:
3
NA