Target
Poly [ADP-ribose] polymerase tankyrase-2 [959-1164]
Ligand
BDBM200005
Substrate
Meas. Tech.
Biochemical Assay
Temperature
298.15±n/a K
IC50
2680±77 nM
Comments
extracted
Citation
 Cheung, AKChin, DNFan, JShultz, MDTomlinson, RC 4-oxo-3,5,7,8-tetrahydro-4H-pyrano[4,3-d]pyrminidinyl compounds for use as tankyrase inhibitors US Patent  US9227982 Publication Date 1/5/2016 
Target
Name:
Poly [ADP-ribose] polymerase tankyrase-2 [959-1164]
Synonyms:
PARP5B TNKL TNKS2_HUMAN | Tankyrase 2 PARP catalytic domain (TNKS2P)
Type:
Mol. Mass.:
23526.94
Organism:
Homo sapiens (Human)
Description:
Q9H2K2[959-1164]
Residue:
206
  
Inhibitor
Name:
BDBM200005
Synonyms:
US9227982, 23
Type:
Small organic molecule
Emp. Form.:
C19H23N3O4
Mol. Mass.:
357.4036
SMILES:
OCCN(Cc1nc2CCOCc2c(=O)[nH]1)C(=O)CCc1ccccc1
: