Target
Plasma kallikrein
Ligand
BDBM200162
Substrate
Meas. Tech.
In Vitro Inhibition Assay
IC50
10±n/a nM
Citation
 Evans, DMDavie, RLEdwards, HJRooker, DP Benzylamine derivatives as inhibitors of plasma kallikrein US Patent  US9234000 Publication Date 1/12/2016 
Target
Name:
Plasma kallikrein
Synonyms:
Fletcher factor KLKB1 Kallikrein Plasma kallikrein heavy chain Plasma prekallikrein
Type:
Protein
Mol. Mass.:
71391.16
Organism:
Homo sapiens (Human)
Description:
P03952
Residue:
638
  
Inhibitor
Name:
BDBM200162
Synonyms:
US9234000, 153
Type:
Small organic molecule
Emp. Form.:
C37H38N4O4S
Mol. Mass.:
634.787
SMILES:
CCOc1ccc(C[C@@H](NC(=O)c2ccccc2)C(=O)N[C@@H](Cc2csc3ccccc23)C(=O)NCc2ccc(CN)cc2)cc1
: