Target
Kallikrein-1
Ligand
BDBM200096
Substrate
Meas. Tech.
In Vitro Inhibition Assay
IC50
3400±n/a nM
Citation
 Evans, DMDavie, RLEdwards, HJRooker, DP Benzylamine derivatives as inhibitors of plasma kallikrein US Patent  US9234000 Publication Date 1/12/2016 
Target
Name:
Kallikrein-1
Synonyms:
KLK1 Kallikrein 1 Kidney/pancreas/salivary gland kallikrein | Tissue kallikrein
Type:
Enzyme
Mol. Mass.:
28874.69
Organism:
Homo sapiens (Human)
Description:
P06870
Residue:
262
  
Inhibitor
Name:
BDBM200096
Synonyms:
US9234000, 87
Type:
Small organic molecule
Emp. Form.:
C38H44N4O4
Mol. Mass.:
620.7804
SMILES:
CCOc1ccc(C[C@@H](NC(=O)CCCc2ccccc2)C(=O)N[C@@H](Cc2ccccc2)C(=O)NCc2ccc(CN)cc2)cc1
: