Target
Cystic fibrosis transmembrane conductance regulator
Ligand
BDBM200238
Substrate
EC50
>80000±n/a nM
Citation
 PubChem, PC Phenotypic Assay to Identify Small Molecules that Upregulate Production of hCFTR in HeLa Cells PubChem Bioassay (2016)[AID] 
Target
Name:
Cystic fibrosis transmembrane conductance regulator
Synonyms:
ABCC7 CFTR Channel conductance-controlling ATPase | cAMP-dependent chloride channel
Type:
Enzyme Catalytic Domain
Mol. Mass.:
168171.30
Organism:
Homo sapiens (Human)
Description:
gi_90421313
Residue:
1480
  
Inhibitor
Name:
BDBM200238
Synonyms:
AB00403923-08 | cid_95022
Type:
Small organic molecule
Emp. Form.:
C16H10O3
Mol. Mass.:
250.2488
SMILES:
O=C(C1C(=O)c2ccccc2C1=O)c1ccccc1
: