Target
Cystic fibrosis transmembrane conductance regulator
Ligand
BDBM200245
Substrate
EC50
>68000±n/a nM
Citation
 PubChem, PC Phenotypic Assay to Identify Small Molecules that Upregulate Production of hCFTR in HeLa Cells PubChem Bioassay (2016)[AID] 
Target
Name:
Cystic fibrosis transmembrane conductance regulator
Synonyms:
ABCC7 CFTR Channel conductance-controlling ATPase | cAMP-dependent chloride channel
Type:
Enzyme Catalytic Domain
Mol. Mass.:
168171.30
Organism:
Homo sapiens (Human)
Description:
gi_90421313
Residue:
1480
  
Inhibitor
Name:
BDBM200245
Synonyms:
AB00984491-01 | cid_73673798
Type:
Small organic molecule
Emp. Form.:
C16H12N4O2
Mol. Mass.:
292.2921
SMILES:
Cc1c(\C=C(\C#N)c2ccc(cc2)[N+]([O-])=O)cc(C#N)n1C
: