Target
Cystic fibrosis transmembrane conductance regulator
Ligand
BDBM200277
Substrate
EC50
>55000±n/a nM
Citation
 PubChem, PC Phenotypic Assay to Identify Small Molecules that Upregulate Production of hCFTR in HeLa Cells PubChem Bioassay (2016)[AID] 
Target
Name:
Cystic fibrosis transmembrane conductance regulator
Synonyms:
ABCC7 CFTR Channel conductance-controlling ATPase | cAMP-dependent chloride channel
Type:
Enzyme Catalytic Domain
Mol. Mass.:
168171.30
Organism:
Homo sapiens (Human)
Description:
gi_90421313
Residue:
1480
  
Inhibitor
Name:
BDBM200277
Synonyms:
AB01003053-01 | cid_42920332
Type:
Small organic molecule
Emp. Form.:
C18H15N5O2S
Mol. Mass.:
365.409
SMILES:
CN(Cc1cnn(c1)-c1ccccc1)C(=O)c1cnc2sccn2c1=O
: