Target
Cystic fibrosis transmembrane conductance regulator
Ligand
BDBM200232
Substrate
EC50
>49000±n/a nM
Citation
 PubChem, PC Phenotypic Assay to Identify Small Molecules that Upregulate Production of hCFTR in HeLa Cells PubChem Bioassay (2016)[AID] 
Target
Name:
Cystic fibrosis transmembrane conductance regulator
Synonyms:
ABCC7 CFTR Channel conductance-controlling ATPase | cAMP-dependent chloride channel
Type:
Enzyme Catalytic Domain
Mol. Mass.:
168171.30
Organism:
Homo sapiens (Human)
Description:
gi_90421313
Residue:
1480
  
Inhibitor
Name:
BDBM200232
Synonyms:
AB01003479-01 | cid_45913338
Type:
Small organic molecule
Emp. Form.:
C20H16N4O4S
Mol. Mass.:
408.43
SMILES:
O=S(=O)(Nc1ccc(cc1)-c1cn2cccnc2n1)c1ccc2OCCOc2c1
: