Target
Proprotein convertase subtilisin/kexin type 9
Ligand
BDBM200326
Substrate
Meas. Tech.
AlphaLISA Assay
IC50
11700±n/a nM
Citation
 Darout, EDullea, RHawkins, JJLondregan, ATLoria, PMMaguire, BMcClure, KFPetersen, DNPiotrowski, DW Substituted amide compounds US Patent  US9227956 Publication Date 1/5/2016 
Target
Name:
Proprotein convertase subtilisin/kexin type 9
Synonyms:
NARC-1 Neural apoptosis-regulated convertase 1 PCSK9 Proprotein convertase 9 Proprotein convertase subtilisin/kexin type 9 (PCSK9) Subtilisin/kexin-like protease PC9
Type:
Enzyme
Mol. Mass.:
74286.93
Organism:
Homo sapiens (Human)
Description:
Q8NBP7
Residue:
692
  
Inhibitor
Name:
BDBM200326
Synonyms:
US9227956, 11
Type:
Small organic molecule
Emp. Form.:
C31H33N5O6
Mol. Mass.:
571.6236
SMILES:
CCOC(=O)OC(C)OC(=O)c1c(cnn1C)-c1ccc(cc1)C(=O)N([C@@H]1CCCNC1)c1nccc2ccccc12
: