Target
Proprotein convertase subtilisin/kexin type 9
Ligand
BDBM200366
Substrate
Meas. Tech.
Cell Free Assay
IC50
3560±n/a nM
Citation
 Darout, EDullea, RHawkins, JJLondregan, ATLoria, PMMaguire, BMcClure, KFPetersen, DNPiotrowski, DW Substituted amide compounds US Patent  US9227956 Publication Date 1/5/2016 
Target
Name:
Proprotein convertase subtilisin/kexin type 9
Synonyms:
NARC-1 Neural apoptosis-regulated convertase 1 PCSK9 Proprotein convertase 9 Proprotein convertase subtilisin/kexin type 9 (PCSK9) Subtilisin/kexin-like protease PC9
Type:
Enzyme
Mol. Mass.:
74286.93
Organism:
Homo sapiens (Human)
Description:
Q8NBP7
Residue:
692
  
Inhibitor
Name:
BDBM200366
Synonyms:
US9227956, 50 | US9227956, 51
Type:
Small organic molecule
Emp. Form.:
C29H35N9O3
Mol. Mass.:
557.6467
SMILES:
CC(C)C(=O)OC(C)n1nnc(n1)-c1c(cnn1C)-c1ccc(cc1)C(=O)N([C@@H]1CCCNC1)c1ncccc1C
: