Target
Complement factor B
Ligand
BDBM159506
Substrate
Meas. Tech.
Human Complement Factor B TR-FRET Assay
pH
7.4±n/a
Temperature
298.15±n/a K
IC50
450±n/a nM
Comments
extracted
Citation
 Adams, CMCapparelli, MPEhara, TKarki, RGMainolfi, NZhang, C Piperidinyl-indole derivatives complement factor B inhibitors and uses thereof US Patent  US10093663 Publication Date 10/9/2018 
Target
Name:
Complement factor B
Synonyms:
BF CFAB_HUMAN | CFB
Type:
Enzyme
Mol. Mass.:
85537.97
Organism:
Homo sapiens (Human)
Description:
P00751
Residue:
764
  
Inhibitor
Name:
BDBM159506
Synonyms:
US10093663, Example 17-12 | US9682968, Example-17-12
Type:
Small organic molecule
Emp. Form.:
C23H26N2O4
Mol. Mass.:
394.4635
SMILES:
COc1cc(C)c2[nH]ccc2c1CN1CC[C@H](O)C[C@H]1c1ccc(cc1)C(O)=O
: