Target
Complement factor B
Ligand
BDBM289485
Substrate
Meas. Tech.
Human Complement Factor B TR-FRET Assay
pH
7.4±n/a
Temperature
298.15±n/a K
IC50
19.0±n/a nM
Comments
extracted
Citation
 Adams, CMCapparelli, MPEhara, TKarki, RGMainolfi, NZhang, C Piperidinyl-indole derivatives complement factor B inhibitors and uses thereof US Patent  US10093663 Publication Date 10/9/2018 
Target
Name:
Complement factor B
Synonyms:
BF CFAB_HUMAN | CFB
Type:
Enzyme
Mol. Mass.:
85537.97
Organism:
Homo sapiens (Human)
Description:
P00751
Residue:
764
  
Inhibitor
Name:
BDBM289485
Synonyms:
US10093663, Example 22-1a
Type:
Small organic molecule
Emp. Form.:
C24H29N3O4
Mol. Mass.:
423.5048
SMILES:
CCOC1CCN(Cc2c(OC)cc(C)c3[nH]ccc23)[C@@H](C1)c1ccc(nc1)C(O)=O
: