Target
Complement factor B
Ligand
BDBM289499
Substrate
Meas. Tech.
Human Complement Factor B TR-FRET Assay
pH
7.4±n/a
Temperature
298.15±n/a K
IC50
16000±n/a nM
Comments
extracted
Citation
 Adams, CMCapparelli, MPEhara, TKarki, RGMainolfi, NZhang, C Piperidinyl-indole derivatives complement factor B inhibitors and uses thereof US Patent  US10093663 Publication Date 10/9/2018 
Target
Name:
Complement factor B
Synonyms:
BF CFAB_HUMAN | CFB
Type:
Enzyme
Mol. Mass.:
85537.97
Organism:
Homo sapiens (Human)
Description:
P00751
Residue:
764
  
Inhibitor
Name:
BDBM289499
Synonyms:
US10093663, Example 27-2b
Type:
Small organic molecule
Emp. Form.:
C25H30N2O3
Mol. Mass.:
406.5173
SMILES:
CCOC1CCN(Cc2c(C)cc(C)c3[nH]ccc23)[C@H](C1)c1ccc(cc1)C(O)=O
: