Target
Dual specificity mitogen-activated protein kinase kinase 1/Mitogen-activated protein kinase 1/Serine/threonine-protein kinase B-raf
Ligand
BDBM200384
Substrate
Meas. Tech.
Cascade Assay
pH
7.5±n/a
IC50
212±n/a nM
Comments
extracted
Citation
 Bock, MGMoebitz, HPanigrahi, SKPoddutoori, RSamajdar, S Compounds and compositions as inhibitors of MEK US Patent  US9227969 Publication Date 1/5/2016 
Target
Name:
Dual specificity mitogen-activated protein kinase kinase 1/Mitogen-activated protein kinase 1/Serine/threonine-protein kinase B-raf
Synonyms:
BRAF-MEK-ERK
Type:
Protein
Mol. Mass.:
Description:
Components:
This complex has 3 components.
Component 1
Name:
Serine/threonine-protein kinase B-raf
Synonyms:
B-RAF B-Raf proto-oncogene serine/threonine-protein kinase BRAF1 RAFB1 v-Raf murine sarcoma viral oncogene homolog B1
Type:
Serine/threonine-protein kinase
Mol. Mass.:
84446.00
Organism:
Homo sapiens (Human)
Description:
P15056
Residue:
766
  
Component 2
Name:
Dual specificity mitogen-activated protein kinase kinase 1
Synonyms:
Dual specificity mitogen-activated protein kinase (MEK) Dual specificity mitogen-activated protein kinase kinase 1 (MEK1) Dual specificity mitogen-activated protein kinase kinase MEK1/2 MAP kinase kinase 1 MAPK/ERK kinase 1 MEK-1 MP2K1_HUMAN PRKMK1 | VHL-MAP2K1/MAP2K2
Type:
Other Protein Type
Mol. Mass.:
43439.03
Organism:
Homo sapiens (Human)
Description:
Full-length human MEK-1 was generated by PCR and purified as a fusion protein from Escherichia coli lysates.
Residue:
393
  
Component 3
Name:
Mitogen-activated protein kinase 1
Synonyms:
ERK2 Extracellular signal-regulated kinase 2 Extracellular signal-regulated kinase 2 (ERK2) MAPK 2 MK01_HUMAN Mitogen-activated protein kinase 1 (ERK-2) Mitogen-activated protein kinase 2 PRKM2 | p42-MAPK
Type:
Ser/Thr Protein Kinase
Mol. Mass.:
41392.76
Organism:
Homo sapiens (Human)
Description:
P28482
Residue:
360
  
Inhibitor
Name:
BDBM200384
Synonyms:
US10011599, Example 12 US9629836, 12
Type:
Small organic molecule
Emp. Form.:
C28H24ClFN6O2
Mol. Mass.:
530.981
SMILES:
CC(=O)N1CCC(CC1)n1c(C)nc2cnc3cc(F)c(cc3c12)-c1ccc(Oc2ncccn2)cc1Cl
: