Target
WD repeat-containing protein 5 [24-334]
Ligand
BDBM200660
Substrate
Meas. Tech.
Binding Assay
pH
6.5±n/a
Temperature
298.15±n/a K
IC50
<1000±n/a nM
Comments
extracted
Citation
 Wang, SKaratas, HDou, YTownsend, EBernard, D Inhibition of WDR5 interaction with its binding partners US Patent  US9233086 Publication Date 1/12/2016 
Target
Name:
WD repeat-containing protein 5 [24-334]
Synonyms:
BIG3 WDR5 | WDR5_HUMAN
Type:
Mol. Mass.:
34198.55
Organism:
Homo sapiens (Human)
Description:
N-terminal His-tagged WDR5Delta23 (residues 24-334)
Residue:
311
  
Inhibitor
Name:
BDBM200660
Synonyms:
US9233086, 3C
Type:
Small organic molecule
Emp. Form.:
C16H31N7O4
Mol. Mass.:
385.4618
SMILES:
CC(C)[C@H](NC(=O)[C@H](CCCNC(N)=N)NC(=O)[C@H](C)NC(C)=O)C(N)=O
: