Target
Beta-2 adrenergic receptor
Ligand
BDBM200746
Substrate
Meas. Tech.
Adrenergic Receptor Binding Assay
Temperature
298.15±n/a K
IC50
18±n/a nM
Comments
extracted
Citation
 Aiguade Bosch, JGual Roig, SPrat Quinones, MPuig Duran, C Cyclohexylamine derivatives having β2 adrenergic agonist and M3 muscarinic antagonist activities US Patent  US9233108 Publication Date 1/12/2016 
Target
Name:
Beta-2 adrenergic receptor
Synonyms:
ADRB2 ADRB2_HUMAN Beta-2 adrenoceptor | Beta-2 adrenoreceptor
Type:
Mol. Mass.:
46461.69
Organism:
Homo sapiens (Human)
Description:
P07550
Residue:
413
  
Inhibitor
Name:
BDBM200746
Synonyms:
US9233108, 8 | US9757383, Example 8
Type:
Small organic molecule
Emp. Form.:
C39H44N4O8S2
Mol. Mass.:
760.919
SMILES:
CN(CCNC(=O)COc1ccc(CNC[C@H](O)c2ccc(O)c3[nH]c(=O)ccc23)cc1)[C@H]1CC[C@@H](CC1)OC(=O)C(O)(c1cccs1)c1cccs1
: