Target
Alpha-1,6-mannosyl-glycoprotein 2-beta-N-acetylglucosaminyltransferase
Ligand
BDBM201243
Substrate
Meas. Tech.
MGAT SPA Assay
pH
7.4±n/a
Temperature
298.15±n/a K
IC50
48±n/a nM
Comments
extracted
Citation
 Turdi, HHangeland, JJLawrence, RMCheng, DAhmad, SMeng, WBrigance, RPDevasthale, PZhao, G Aryl dihydropyridinones and piperidinone MGAT2 inhibitors US Patent  US9187424 Publication Date 11/17/2015 
Target
Name:
Alpha-1,6-mannosyl-glycoprotein 2-beta-N-acetylglucosaminyltransferase
Synonyms:
2.4.1.143 GNT-II MGAT2 Mannoside acetylglucosaminyltransferase 2 Monoacylglycerol acyltransferase type 2 (h-MGAT2) h-MGAT2 (human monoacylglycerol acyltransferase type 2)
Type:
Mol. Mass.:
51567.80
Organism:
Homo sapiens (Human)
Description:
Q10469
Residue:
447
  
Inhibitor
Name:
BDBM201243
Synonyms:
US9187424, 11
Type:
Small organic molecule
Emp. Form.:
C31H28F6N2O4
Mol. Mass.:
606.5554
SMILES:
Cc1ccc(cc1)C1=C(C(=O)Nc2ccc(OC(F)(F)F)cc2)C(=O)NC(C)(C1)c1ccc(OCCCC(F)(F)F)cc1
: