Target
Mitogen-activated protein kinase 1
Ligand
BDBM201695
Substrate
Meas. Tech.
IMAP-FP Assay
IC50
0.2±n/a nM
Citation
Target
Name:
Mitogen-activated protein kinase 1
Synonyms:
ERK2 Extracellular signal-regulated kinase 2 Extracellular signal-regulated kinase 2 (ERK2) MAPK 2 MK01_HUMAN Mitogen-activated protein kinase 1 (ERK-2) Mitogen-activated protein kinase 2 PRKM2 | p42-MAPK
Type:
Ser/Thr Protein Kinase
Mol. Mass.:
41392.76
Organism:
Homo sapiens (Human)
Description:
P28482
Residue:
360
  
Inhibitor
Name:
BDBM201695
Synonyms:
US9233979, 126
Type:
Small organic molecule
Emp. Form.:
C24H27FN8O2
Mol. Mass.:
478.522
SMILES:
Cn1cc2CN(CCc2n1)c1n[nH]c2cc(NC(=O)N[C@@H](c3ccc(F)cc3)C(C)(C)O)ncc12
: