Target
Tyrosine-protein kinase BTK
Ligand
BDBM202214
Substrate
Meas. Tech.
Recombinant Human BTK Inhibition Assay
IC50
1.3±n/a nM
Citation
 Thakkar, MKoul, SBhuniya, DMookhtiar, KKurhade, SMunot, YMengawade, TKulkarni, BA Substituted hetero-bicyclic compounds, compositions and medicinal applications thereof US Patent  US9233983 Publication Date 1/12/2016 
Target
Name:
Tyrosine-protein kinase BTK
Synonyms:
AGMX1 Agammaglobulinaemia tyrosine kinase B cell progenitor kinase BPK BTK_HUMAN Tyrosine Kinase BTK Tyrosine-protein kinase BTK (BTK)
Type:
Enzyme
Mol. Mass.:
76289.95
Organism:
Homo sapiens (Human)
Description:
Q06187
Residue:
659
  
Inhibitor
Name:
BDBM202214
Synonyms:
US9233983, P-29
Type:
Small organic molecule
Emp. Form.:
C34H33FN4O5
Mol. Mass.:
596.648
SMILES:
CC(O)C(=O)N1CCC(=CC1)c1cc2c(ccnc2[nH]1)-c1cccc(N2CCOc3cc(cc(F)c3C2=O)C2CC2)c1CO
: