Target
Epidermal growth factor receptor
Ligand
BDBM202369
Substrate
Meas. Tech.
Omnia Assay
pH
7.5±n/a
Temperature
298.15±n/a K
IC50
200±n/a nM
Comments
extracted
Citation
 Lee, KNiu, DPetter, RCSingh, J Heteroaryl compounds and uses thereof US Patent  US9238629 Publication Date 1/19/2016 
Target
Name:
Epidermal growth factor receptor
Synonyms:
EGF Receptor Substrate EGFR_HUMAN ERBB1 Epidermal Growth Factor Receptor erbB-1 Epidermal growth factor receptor (EGFR) HER1 Proto-oncogene c-ErbB-1 Tyrosine-Protein Kinase ErbB-1
Type:
Receptor Kinase Domain
Mol. Mass.:
134279.59
Organism:
Homo sapiens (Human)
Description:
P00533
Residue:
1210
  
Inhibitor
Name:
BDBM202369
Synonyms:
US10081606, Compound I-1 US9765038, Compound I-1
Type:
Small organic molecule
Emp. Form.:
C21H18F3N5O2
Mol. Mass.:
429.3951
SMILES:
COc1ccccc1Nc1ncc(c(Nc2cccc(NC(=O)C=C)c2)n1)C(F)(F)F
: