Target
Vascular endothelial growth factor receptor 3
Ligand
BDBM202401
Substrate
Meas. Tech.
VEGFR3 Phospho ELISA Assay
pH
7.2±n/a
Temperature
310.15±n/a K
IC50
19±n/a nM
Comments
extracted
Citation
 Foitzik, RCMorrow, BJHemley, CFLunniss, GECamerino, MAGaname, DStupple, PALessene, RKersten, WJHarvey, AJHolmes, IP VEGFR3 inhibitors US Patent  US9238644 Publication Date 1/19/2016 
Target
Name:
Vascular endothelial growth factor receptor 3
Synonyms:
FLT-4 Fms-like tyrosine kinase 4 VEGFR-3 VGFR3_HUMAN Vascular endothelial growth factor receptor 3 (VEGFR-3) | Vascular endothelial growth factor receptor 3 (VEGFR3)
Type:
Protein
Mol. Mass.:
152749.58
Organism:
Homo sapiens (Human)
Description:
P35916-2
Residue:
1363
  
Inhibitor
Name:
BDBM202401
Synonyms:
US9238644, 8
Type:
Small organic molecule
Emp. Form.:
C28H32ClN5O
Mol. Mass.:
490.04
SMILES:
CN1CCC(CC1)c1ccc(Nc2ncc(Cl)c(CCc3ccccc3C3(CC3)C(N)=O)n2)cc1
: