Target
Mitogen-activated protein kinase kinase kinase 12
Ligand
BDBM289425
Substrate
Meas. Tech.
Biological Activity Assay
Kd
2.30±n/a nM
Citation
 Soth, MJLiu, GLe, KCross, JJones, P Bicyclo[1.1.1]pentane inhibitors of dual leucine zipper (DLK) kinase for the treatment of disease US Patent  US10093664 Publication Date 10/9/2018 
Target
Name:
Mitogen-activated protein kinase kinase kinase 12
Synonyms:
DLK Leucine-zipper protein kinase MAP3K12 MUK Mixed lineage kinase | ZPK
Type:
PROTEIN
Mol. Mass.:
93216.56
Organism:
Homo sapiens (Human)
Description:
ChEMBL_1460553
Residue:
859
  
Inhibitor
Name:
BDBM289425
Synonyms:
(R)-(4-(6-amino-5-(trifluoromethyl)pyridin-3-yl)-1-(bicyclo[1.1.1]pentan-1-yl)-1H-imidazol-2-yl)(cyclopropyl)methanol | US10093664, Example 5b
Type:
Small organic molecule
Emp. Form.:
C18H19F3N4O
Mol. Mass.:
364.3649
SMILES:
Nc1ncc(cc1C(F)(F)F)-c1cn(c(n1)[C@H](O)C1CC1)C12CC(C1)C2
: