Target
Mitogen-activated protein kinase kinase kinase 12
Ligand
BDBM289433
Substrate
Meas. Tech.
Biological Activity Assay
Kd
47.0±n/a nM
Citation
 Soth, MJLiu, GLe, KCross, JJones, P Bicyclo[1.1.1]pentane inhibitors of dual leucine zipper (DLK) kinase for the treatment of disease US Patent  US10093664 Publication Date 10/9/2018 
Target
Name:
Mitogen-activated protein kinase kinase kinase 12
Synonyms:
DLK Leucine-zipper protein kinase MAP3K12 MUK Mixed lineage kinase | ZPK
Type:
PROTEIN
Mol. Mass.:
93216.56
Organism:
Homo sapiens (Human)
Description:
ChEMBL_1460553
Residue:
859
  
Inhibitor
Name:
BDBM289433
Synonyms:
5-(1-(3-(1,4-oxazepan-4-yl)bicyclo[1.1.1]pentan-1-yl)-2-cyclopropyl-1H-imidazol-4-yl)-3-(trifluoromethoxy)pyridin-2-amine | US10093664, Example 14
Type:
Small organic molecule
Emp. Form.:
C22H26F3N5O2
Mol. Mass.:
449.4693
SMILES:
Nc1ncc(cc1OC(F)(F)F)-c1cn(c(n1)C1CC1)C12CC(C1)(C2)N1CCCOCC1
: