Target
Mitogen-activated protein kinase kinase kinase 12
Ligand
BDBM289440
Substrate
Meas. Tech.
Biological Activity Assay
Kd
330±n/a nM
Citation
 Soth, MJLiu, GLe, KCross, JJones, P Bicyclo[1.1.1]pentane inhibitors of dual leucine zipper (DLK) kinase for the treatment of disease US Patent  US10093664 Publication Date 10/9/2018 
Target
Name:
Mitogen-activated protein kinase kinase kinase 12
Synonyms:
DLK Leucine-zipper protein kinase MAP3K12 MUK Mixed lineage kinase | ZPK
Type:
PROTEIN
Mol. Mass.:
93216.56
Organism:
Homo sapiens (Human)
Description:
ChEMBL_1460553
Residue:
859
  
Inhibitor
Name:
BDBM289440
Synonyms:
4-(3-(2-cyclopropyl-4-(1-(2-fluoroethyl)-H-pyrrolo[3,2-b]pyridin-6-yl)-H-imidazol-1-yl)bicyclo[1.1.1]pentan-1-yl)morpholine | US10093664, Example 21
Type:
Small organic molecule
Emp. Form.:
C24H28FN5O
Mol. Mass.:
421.5104
SMILES:
FCCn1ccc2ncc(cc12)-c1cn(c(n1)C1CC1)C12CC(C1)(C2)N1CCOCC1
: