Target
Mitogen-activated protein kinase kinase kinase 12
Ligand
BDBM289459
Substrate
Meas. Tech.
Biological Activity Assay
Kd
22.0±n/a nM
Citation
 Soth, MJLiu, GLe, KCross, JJones, P Bicyclo[1.1.1]pentane inhibitors of dual leucine zipper (DLK) kinase for the treatment of disease US Patent  US10093664 Publication Date 10/9/2018 
Target
Name:
Mitogen-activated protein kinase kinase kinase 12
Synonyms:
DLK Leucine-zipper protein kinase MAP3K12 MUK Mixed lineage kinase | ZPK
Type:
PROTEIN
Mol. Mass.:
93216.56
Organism:
Homo sapiens (Human)
Description:
ChEMBL_1460553
Residue:
859
  
Inhibitor
Name:
BDBM289459
Synonyms:
5-(2-(cyclopropyl- methyl)-1-(3-morpho- linobicyclo[1.1.1]- pentan-1-yl)-1H- imidazol-4-yl)-3-(di- fluoromethoxy)pyridin- 2-amine | US10093664, Example 36
Type:
Small organic molecule
Emp. Form.:
C22H27F2N5O2
Mol. Mass.:
431.4789
SMILES:
Nc1ncc(cc1OC(F)F)-c1cn(c(CC2CC2)n1)C12CC(C1)(C2)N1CCOCC1
: