Target
Mitogen-activated protein kinase kinase kinase 12
Ligand
BDBM289480
Substrate
Meas. Tech.
Biological Activity Assay
Kd
5.10±n/a nM
Citation
 Soth, MJLiu, GLe, KCross, JJones, P Bicyclo[1.1.1]pentane inhibitors of dual leucine zipper (DLK) kinase for the treatment of disease US Patent  US10093664 Publication Date 10/9/2018 
Target
Name:
Mitogen-activated protein kinase kinase kinase 12
Synonyms:
DLK Leucine-zipper protein kinase MAP3K12 MUK Mixed lineage kinase | ZPK
Type:
PROTEIN
Mol. Mass.:
93216.56
Organism:
Homo sapiens (Human)
Description:
ChEMBL_1460553
Residue:
859
  
Inhibitor
Name:
BDBM289480
Synonyms:
(4-(6-amino-5-(tri- fluoromethoxy)pyridin- 3-yl)-1-(bicyclo[1.1.1]- pentan-1-yl)-1H-imid- azol-2-yl)(cyclo- propyl)methanol | US10093664, Example 56
Type:
Small organic molecule
Emp. Form.:
C18H19F3N4O2
Mol. Mass.:
380.3643
SMILES:
Nc1ncc(cc1OC(F)(F)F)-c1cn(c(n1)C(O)C1CC1)C12CC(C1)C2
: