Target
Mitogen-activated protein kinase kinase kinase 12
Ligand
BDBM289505
Substrate
Meas. Tech.
Biological Activity Assay
Kd
0.360±n/a nM
Citation
 Soth, MJLiu, GLe, KCross, JJones, P Bicyclo[1.1.1]pentane inhibitors of dual leucine zipper (DLK) kinase for the treatment of disease US Patent  US10093664 Publication Date 10/9/2018 
Target
Name:
Mitogen-activated protein kinase kinase kinase 12
Synonyms:
DLK Leucine-zipper protein kinase MAP3K12 MUK Mixed lineage kinase | ZPK
Type:
PROTEIN
Mol. Mass.:
93216.56
Organism:
Homo sapiens (Human)
Description:
ChEMBL_1460553
Residue:
859
  
Inhibitor
Name:
BDBM289505
Synonyms:
1-(4-(6-amino-5-(tri- fluoromethyl)pyridin-3- yl)-1-(3-morpholino- bicyclo[1.1.1]pentan-1- yl)-1H-imidazol-2-yl)- 2,2,2-trifluoroethan-1- ol | US10093664, Example 69a
Type:
Small organic molecule
Emp. Form.:
C20H21F6N5O2
Mol. Mass.:
477.4035
SMILES:
Nc1ncc(cc1C(F)(F)F)-c1cn(c(n1)C(O)C(F)(F)F)C12CC(C1)(C2)N1CCOCC1
: