Target
Prostaglandin G/H synthase 1
Ligand
BDBM202547
Substrate
Meas. Tech.
In vitro COX Inhibition Assay
pH
8±n/a
Temperature
298.15±n/a K
IC50
1.2e+3± 1.5e+2 nM
Comments
extracted
Citation
 Abd-Ellah, HSAbdel-Aziz, MShoman, MEBeshr, EAKaoud, TSAhmed, AF Novel 1,3,4-oxadiazole/oxime hybrids: Synthesis, docking studies and investigation of anti-inflammatory, ulcerogenic liability and analgesic activities. Bioorg Chem 69:48-63 (2016)  
Target
Name:
Prostaglandin G/H synthase 1
Synonyms:
COX1 Cyclooxygenase-1 (COX-1) PTGS1 | Prostaglandin G/H synthase (cyclooxygenase)
Type:
Protein
Mol. Mass.:
68868.60
Organism:
Ovis aries (Sheep)
Description:
Residue:
600
  
Inhibitor
Name:
BDBM202547
Synonyms:
N-(4-acetylphenyl)-2-[(5-phenyl-1,3,4-oxadiazol-2-yl)sulfanyl]acetamide (7a)
Type:
Small organic molecule
Emp. Form.:
C18H15N3O3S
Mol. Mass.:
353.395
SMILES:
CC(=O)c1ccc(NC(=O)CSc2nnc(o2)-c2ccccc2)cc1
: