Target
Tyrosine-protein kinase JAK3
Ligand
BDBM202554
Substrate
Meas. Tech.
Kinase HotSpot Assay
IC50
0.154±0.0 nM
Citation
 Forster, MChaikuad, ABauer, SMHolstein, JRobers, MBCorona, CRGehringer, MPfaffenrot, EGhoreschi, KKnapp, SLaufer, SA Selective JAK3 Inhibitors with a Covalent Reversible Binding Mode Targeting a New Induced Fit Binding Pocket. Cell Chem Biol 23:1335-1340 (2016)  
Target
Name:
Tyrosine-protein kinase JAK3
Synonyms:
JAK-3 JAK3_HUMAN Janus kinase 3 (JAK3) L-JAK | Leukocyte janus kinase
Type:
Protein
Mol. Mass.:
125111.08
Organism:
Homo sapiens (Human)
Description:
P52333
Residue:
1124
  
Inhibitor
Name:
BDBM202554
Synonyms:
(E/Z)-2-cyano-N,N-dimethyl-3-(5-(1-((1S,2R)-2-methylcyclohexyl)-1,6-dihydroimidazo[4,5-d]pyrrolo[2,3-b]pyridin-2-yl)furan-2-yl)acrylamide (5)
Type:
Small organic molecule
Emp. Form.:
C25H26N6O2
Mol. Mass.:
442.5129
SMILES:
C[C@@H]1CCCC[C@@H]1n1c(nc2cnc3[nH]ccc3c12)-c1ccc(\C=C(/C#N)C(=O)N(C)C)o1
: