Target
Multidrug resistance-associated protein 1
Ligand
BDBM202570
Substrate
Meas. Tech.
Calcein-AM Assay
IC50
>1.00e+5±n/a nM
Citation
 Stefanachi, AMangiatordi, GFTardia, PAlberga, DLeonetti, FNiso, MColabufo, NAAdamo, CNicolotti, OCellamare, S Design, synthesis, biological evaluation, NMR and DFT studies of structurally simplified trimethoxy benzamides as selective P-glycoprotein inhibitors: the role of molecular flatness. Chem Biol Drug Des 88:820-831 (2016)  
Target
Name:
Multidrug resistance-associated protein 1
Synonyms:
7.6.2.2 ABCC1 ATP-binding cassette, sub-family C, member 1 isoform 1 LTC4 transporter MRP MRP1_HUMAN
Type:
Mol. Mass.:
171597.72
Organism:
Homo sapiens (Human)
Description:
P33527
Residue:
1531
  
Inhibitor
Name:
BDBM202570
Synonyms:
4-bromo-2-methoxy-N-(2,4,5-trimethoxyphenyl)benzamide (17)
Type:
Small organic molecule
Emp. Form.:
C17H18BrNO5
Mol. Mass.:
396.233
SMILES:
COc1cc(OC)c(OC)cc1NC(=O)c1ccc(Br)cc1OC
: