Target
Sodium-dependent dopamine transporter
Ligand
BDBM202586
Substrate
Meas. Tech.
Radioligand Binding Assay
Ki
67.56±n/a nM
Citation
 Bhat, LAdiey, KBhat, SR Compositions, synthesis, and methods of using phenylcycloalkylmethylamine derivatives US Patent  US9238625 Publication Date 1/19/2016 
Target
Name:
Sodium-dependent dopamine transporter
Synonyms:
DA transporter DAT1 Dopamine transporter protein (DAT) SC6A3_HUMAN Sodium-dependent dopamine transporter Solute carrier family 6 member 3
Type:
Multi-pass membrane protein
Mol. Mass.:
68497.11
Organism:
Homo sapiens (Human)
Description:
Q01959
Residue:
620
  
Inhibitor
Name:
BDBM202586
Synonyms:
US10035761, Compound 12b | US9238625, 12b
Type:
Small organic molecule
Emp. Form.:
C21H34ClNS
Mol. Mass.:
368.019
SMILES:
CCSCCCCNC(CC(C)C)C1(CCC1)c1ccc(Cl)cc1
: