Target
Sodium-dependent noradrenaline transporter
Ligand
BDBM202586
Substrate
Meas. Tech.
Radioligand Binding Assay
Ki
51.87±n/a nM
Citation
 Bhat, LAdiey, KBhat, SR Compositions, synthesis, and methods of using phenylcycloalkylmethylamine derivatives US Patent  US9238625 Publication Date 1/19/2016 
Target
Name:
Sodium-dependent noradrenaline transporter
Synonyms:
Monoamine transporter NET Noradrenaline Transporter (NET) Norepinephrine transporter protein (NET) SLC6A2 Sodium-dependent noradrenaline transporter (NET) | Solute carrier family 6 member 2
Type:
Multi-pass membrane protein
Mol. Mass.:
69337.72
Organism:
Homo sapiens (Human)
Description:
P23975
Residue:
617
  
Inhibitor
Name:
BDBM202586
Synonyms:
US10035761, Compound 12b | US9238625, 12b
Type:
Small organic molecule
Emp. Form.:
C21H34ClNS
Mol. Mass.:
368.019
SMILES:
CCSCCCCNC(CC(C)C)C1(CCC1)c1ccc(Cl)cc1
: