Target
Sodium-dependent noradrenaline transporter
Ligand
BDBM202591
Substrate
Meas. Tech.
Radioligand Binding Assay
Ki
44.72±n/a nM
Citation
 Bhat, LAdiey, KBhat, SR Compositions, synthesis, and methods of using phenylcycloalkylmethylamine derivatives US Patent  US9238625 Publication Date 1/19/2016 
Target
Name:
Sodium-dependent noradrenaline transporter
Synonyms:
Monoamine transporter NET Noradrenaline Transporter (NET) Norepinephrine transporter protein (NET) SLC6A2 Sodium-dependent noradrenaline transporter (NET) | Solute carrier family 6 member 2
Type:
Multi-pass membrane protein
Mol. Mass.:
69337.72
Organism:
Homo sapiens (Human)
Description:
P23975
Residue:
617
  
Inhibitor
Name:
BDBM202591
Synonyms:
US10035761, Compound 17a | US9238625, 17a
Type:
Small organic molecule
Emp. Form.:
C21H33Cl2NO2S
Mol. Mass.:
434.463
SMILES:
CCS(=O)(=O)CCCCNC(CC(C)C)C1(CCC1)c1ccc(Cl)c(Cl)c1
: