Target
Nitric oxide synthase, brain
Ligand
BDBM202648
Substrate
Meas. Tech.
Inhibition Assay
Ki
73±n/a nM
Citation
 Silverman, RBHuang, HJing, Q Thiophene-2-carboximidamide based selective neuronal nitric oxide inhibitors US Patent  US9242957 Publication Date 1/26/2016 
Target
Name:
Nitric oxide synthase, brain
Synonyms:
Bnos NC-NOS NOS type I nNOS Neuronal nitric oxide synthase Nitric Oxide Synthase, brain Nitric oxide synthase, brain (nNOS) Nitric-oxide synthase, brain (nNOS) Nos1 | Peptidyl-cysteine S-nitrosylase NOS1
Type:
Enzyme
Mol. Mass.:
160570.98
Organism:
Rattus norvegicus (rat)
Description:
Recombinant nNOS overexpressed in E. coli was used in enzyme assays.
Residue:
1429
  
Inhibitor
Name:
BDBM202648
Synonyms:
US9242957, 64
Type:
Small organic molecule
Emp. Form.:
C22H24FN3S
Mol. Mass.:
381.509
SMILES:
CCN(CCc1cccc(F)c1)Cc1cccc(NC(=N)c2cccs2)c1
: