Target
Nitric oxide synthase, brain
Ligand
BDBM50023384
Substrate
Meas. Tech.
Inhibition Assay
Ki
14.7±n/a nM
Citation
 Silverman, RBHuang, HJing, Q Thiophene-2-carboximidamide based selective neuronal nitric oxide inhibitors US Patent  US9242957 Publication Date 1/26/2016 
Target
Name:
Nitric oxide synthase, brain
Synonyms:
Bnos NC-NOS NOS type I nNOS Neuronal nitric oxide synthase Nitric Oxide Synthase, brain Nitric oxide synthase, brain (nNOS) Nitric-oxide synthase, brain (nNOS) Nos1 | Peptidyl-cysteine S-nitrosylase NOS1
Type:
Enzyme
Mol. Mass.:
160570.98
Organism:
Rattus norvegicus (rat)
Description:
Recombinant nNOS overexpressed in E. coli was used in enzyme assays.
Residue:
1429
  
Inhibitor
Name:
BDBM50023384
Synonyms:
CHEMBL3325610 | US9242957, QJ-II-203
Type:
Small organic molecule
Emp. Form.:
C27H29N5O2S2
Mol. Mass.:
519.681
SMILES:
NC[C@@H](COCc1cccc(NC(=N)c2cccs2)c1)OCc1cccc(NC(=N)c2cccs2)c1
: