Target
Dual specificity calcium/calmodulin-dependent 3',5'-cyclic nucleotide phosphodiesterase 1B
Ligand
BDBM289650
Substrate
Meas. Tech.
IMAP TR-FRET assay
Temperature
298.15±n/a K
EC50
<100±n/a nM
Comments
extracted
Citation
 Branstetter, BBreitenbucher, JDyck, BGomez, LHudson, ARMarrone, TJPeters, MVickers, T Substituted thiophene- and furan-fused azolopyrimidine-5-(6H)-one compounds US Patent  US10092575 Publication Date 10/9/2018 
Target
Name:
Dual specificity calcium/calmodulin-dependent 3',5'-cyclic nucleotide phosphodiesterase 1B
Synonyms:
63 kDa Cam-PDE Calcium/calmodulin-dependent 3',5'-cyclic nucleotide phosphodiesterase 1B PDE1B PDE1B_HUMAN Phosphodiesterase 1B Phosphodiesterase Type 1 (PDE1B) | Phosphodiesterase, PDE1/PDE5
Type:
Enzyme
Mol. Mass.:
61366.51
Organism:
Homo sapiens (Human)
Description:
Residue:
536
  
Inhibitor
Name:
BDBM289650
Synonyms:
6-(2-Fluoro-4-methoxybenzyl)-9-((1-methyl-1H-imidazol-2-yl)methyl)-8,9,10,11-tetrahydropyrido[4',3':4,5]thieno[3,2-e][1,2,4]triazolo[1,5-c]pyrimidin-5(6H)-one US10376514, Example 138
Type:
Small organic molecule
Emp. Form.:
C23H22FN7O2S
Mol. Mass.:
479.53
SMILES:
COc1ccc(Cn2c3sc4CN(Cc5nccn5C)CCc4c3c3ncnn3c2=O)c(F)c1
: