Target
Dual specificity calcium/calmodulin-dependent 3',5'-cyclic nucleotide phosphodiesterase 1B
Ligand
BDBM289668
Substrate
Meas. Tech.
IMAP TR-FRET assay
Temperature
298.15±n/a K
EC50
<100±n/a nM
Comments
extracted
Citation
 Branstetter, BBreitenbucher, JDyck, BGomez, LHudson, ARMarrone, TJPeters, MVickers, T Substituted thiophene- and furan-fused azolopyrimidine-5-(6H)-one compounds US Patent  US10092575 Publication Date 10/9/2018 
Target
Name:
Dual specificity calcium/calmodulin-dependent 3',5'-cyclic nucleotide phosphodiesterase 1B
Synonyms:
63 kDa Cam-PDE Calcium/calmodulin-dependent 3',5'-cyclic nucleotide phosphodiesterase 1B PDE1B PDE1B_HUMAN Phosphodiesterase 1B Phosphodiesterase Type 1 (PDE1B) | Phosphodiesterase, PDE1/PDE5
Type:
Enzyme
Mol. Mass.:
61366.51
Organism:
Homo sapiens (Human)
Description:
Residue:
536
  
Inhibitor
Name:
BDBM289668
Synonyms:
6-(4-Chlorobenzyl)-9-(pyrazine-2-carbonyl)-8,9,10,11-tetrahydropyrido[4',3':4,5]thieno[3,2-e][1,2,4]triazolo[1,5-c]pyrimidin-5(6H)-one US10376514, Example 157
Type:
Small organic molecule
Emp. Form.:
C22H16ClN7O2S
Mol. Mass.:
477.926
SMILES:
Clc1ccc(Cn2c3sc4CN(CCc4c3c3ncnn3c2=O)C(=O)c2cnccn2)cc1
: