Target
RAF proto-oncogene serine/threonine-protein kinase [1-324]
Ligand
BDBM202698
Substrate
Meas. Tech.
In Vitro Enzyme Assay
pH
7.5±n/a
Temperature
298.15±n/a K
IC50
0.714±n/a nM
Comments
extracted
Citation
 Barsanti, PABurger, MLou, YNishiguchi, GPolyakov, VRamurthy, SRico, ASetti, LSmith, ATaft, BTanner, HDiPesa, AYusuff, N Biaryl amide compounds as kinase inhibitors US Patent  US9242969 Publication Date 1/26/2016 
Target
Name:
RAF proto-oncogene serine/threonine-protein kinase [1-324]
Synonyms:
C-Raf TR (aa 1-324) RAF RAF1_HUMAN
Type:
Mol. Mass.:
36996.69
Organism:
Homo sapiens (Human)
Description:
P04049 (1-324)
Residue:
324
  
Inhibitor
Name:
BDBM202698
Synonyms:
US10245267, Example 44 US9242969, 44 | US9694016, 44
Type:
Small organic molecule
Emp. Form.:
C26H27F3N4O2
Mol. Mass.:
484.5134
SMILES:
CC(C)c1cc(nc(n1)-c1cc(NC(=O)c2cccc(c2)C(F)(F)F)ccc1C)N1CCOCC1
: