Target
Orexin/Hypocretin receptor type 1
Ligand
BDBM202950
Substrate
Meas. Tech.
In Vitro Assay: Intracellular Calcium Measurements
Temperature
310.15±n/a K
IC50
5±n/a nM
Comments
extracted
Citation
 Aissaoui, HBoss, CBrotschi, CHeidmann, BSifferlen, TWilliams, JT Lactam derivatives useful as orexin receptor antagonists US Patent  US9242970 Publication Date 1/26/2016 
Target
Name:
Orexin/Hypocretin receptor type 1
Synonyms:
HCRTR1 OX1R_HUMAN Orexin receptor type 1 (OR 1) Orexin receptor type 1 (OX1) Orexin receptor type 1 (OxR1) | Ox1r
Type:
Protein
Mol. Mass.:
47554.50
Organism:
Homo sapiens (Human)
Description:
O43613
Residue:
425
  
Inhibitor
Name:
BDBM202950
Synonyms:
US9242970, 97
Type:
Small organic molecule
Emp. Form.:
C24H27N3O3
Mol. Mass.:
405.4895
SMILES:
COc1cccc(OC)c1C1CCCCC(=O)N1Cc1cccc(c1)-n1cccn1
: