Target
Interleukin-1 receptor-associated kinase 4
Ligand
BDBM203284
Substrate
Meas. Tech.
IRAK4 Inhibition Assay
pH
7.2±n/a
Temperature
298.15±n/a K
IC50
3.2±n/a nM
Comments
extracted
Citation
 Paidi, VRKumar, SRBanerjee, ASistla, RNair, SKPitts, WJHynes, J Heterocyclic-substituted pyridyl compounds useful as kinase inhibitors US Patent  US9242975 Publication Date 1/26/2016 
Target
Name:
Interleukin-1 receptor-associated kinase 4
Synonyms:
IRAK-4 IRAK4_HUMAN Interleukin-1 receptor-associated kinase 4 (IRAK4) | Renal carcinoma antigen NY-REN-64
Type:
Protein
Mol. Mass.:
51519.08
Organism:
Homo sapiens (Human)
Description:
Q9NWZ3
Residue:
460
  
Inhibitor
Name:
BDBM203284
Synonyms:
US10227340, Example 7 US9242975, 7
Type:
Small organic molecule
Emp. Form.:
C22H23N7O2S2
Mol. Mass.:
481.594
SMILES:
CC(C)Nc1cc(Nc2ccc3ncsc3c2)ncc1-c1nnc(s1)C(=O)N1CCC(O)C1
: