Target
Mitogen-activated protein kinase 1
Ligand
BDBM203321
Substrate
Meas. Tech.
TdF (Temperature Dependence Fluorescence) Assay
Temperature
303.15±n/a K
Kd
0.15±n/a nM
Comments
extracted
Citation
 Shipps, Jr., GWDeng, YCooper, ABGao, XSun, BWang, JZhu, L Fused pyrazole derivatives as novel ERK inhibitors US Patent  US9242981 Publication Date 1/26/2016 
Target
Name:
Mitogen-activated protein kinase 1
Synonyms:
ERT1 Extracellular signal-regulated kinase 2 MAP kinase 1 MAP kinase ERK2 MAPK 2 Mapk Mitogen-activated protein kinase 2 p42 | p42-MAPK
Type:
Protein
Mol. Mass.:
41278.65
Organism:
Mus musculus (Mouse)
Description:
P63085
Residue:
358
  
Inhibitor
Name:
BDBM203321
Synonyms:
US9242981, 53
Type:
Small organic molecule
Emp. Form.:
C25H29FN6O2
Mol. Mass.:
464.5352
SMILES:
COc1cccc(F)c1CN1CCC[C@H](C1)NC(=O)N1CCc2[nH]nc(c2C1)-c1ccncc1
: