Target
Mitogen-activated protein kinase 1
Ligand
BDBM203322
Substrate
Meas. Tech.
IMAP Assay
IC50
1.97±n/a nM
Citation
 Shipps, Jr., GWDeng, YCooper, ABGao, XSun, BWang, JZhu, L Fused pyrazole derivatives as novel ERK inhibitors US Patent  US9242981 Publication Date 1/26/2016 
Target
Name:
Mitogen-activated protein kinase 1
Synonyms:
ERT1 Extracellular signal-regulated kinase 2 MAP kinase 1 MAP kinase ERK2 MAPK 2 Mapk Mitogen-activated protein kinase 2 p42 | p42-MAPK
Type:
Protein
Mol. Mass.:
41278.65
Organism:
Mus musculus (Mouse)
Description:
P63085
Residue:
358
  
Inhibitor
Name:
BDBM203322
Synonyms:
US9242981, 54
Type:
Small organic molecule
Emp. Form.:
C24H26F2N6O
Mol. Mass.:
452.4996
SMILES:
Fc1cccc(F)c1CN1CCC[C@H](C1)NC(=O)N1CCc2[nH]nc(c2C1)-c1ccncc1
: