Target
Mitogen-activated protein kinase 1
Ligand
BDBM203330
Substrate
Meas. Tech.
IMAP Assay
IC50
2.01±n/a nM
Citation
 Shipps, Jr., GWDeng, YCooper, ABGao, XSun, BWang, JZhu, L Fused pyrazole derivatives as novel ERK inhibitors US Patent  US9242981 Publication Date 1/26/2016 
Target
Name:
Mitogen-activated protein kinase 1
Synonyms:
ERT1 Extracellular signal-regulated kinase 2 MAP kinase 1 MAP kinase ERK2 MAPK 2 Mapk Mitogen-activated protein kinase 2 p42 | p42-MAPK
Type:
Protein
Mol. Mass.:
41278.65
Organism:
Mus musculus (Mouse)
Description:
P63085
Residue:
358
  
Inhibitor
Name:
BDBM203330
Synonyms:
US9242981, 62
Type:
Small organic molecule
Emp. Form.:
C28H31N7O2
Mol. Mass.:
497.5914
SMILES:
CC(=O)n1cc(CN2CCC[C@H](C2)NC(=O)N2CCc3[nH]nc(c3C2)-c2ccncc2)c2ccccc12
: