Target
Acetylcholinesterase
Ligand
BDBM203856
Substrate
Meas. Tech.
AChE and BuChE Inhibition Assay
pH
8±n/a
Temperature
298.15±n/a K
IC50
>1.00e+5±n/a nM
Comments
extracted
Citation
 Leng, JQin, HLZhu, KJantan, IHussain, MASher, MAmjad, MWNaeem-Ul-Hassan, MAhmad, WBukhari, SN Evaluation of multifunctional synthetic tetralone derivatives for treatment of Alzheimer's disease. Chem Biol Drug Des 88:889-898 (2016)  
Target
Name:
Acetylcholinesterase
Synonyms:
ACES_ELEEL Acetylcholinesterase (EeAChE) | ache
Type:
Enzyme
Mol. Mass.:
71812.79
Organism:
Electrophorus electricus (Electric eel)
Description:
Residue:
633
  
Inhibitor
Name:
BDBM203856
Synonyms:
(2E)-2-[(2-chloro-3,4-dimethoxyphenyl)methylidene]-7-fluoro-1,2,3,4-tetrahydronaphthalen-1-one (3ac)
Type:
Small organic molecule
Emp. Form.:
C19H16ClFO3
Mol. Mass.:
346.78
SMILES:
COc1ccc(\C=C2/CCc3ccc(F)cc3C2=O)c(Cl)c1OC
: