Target
Complement factor D [24-253]
Ligand
BDBM203868
Substrate
Meas. Tech.
Complement FD Thioesterolysis Assay
pH
7.5±n/a
Temperature
298.15±n/a K
IC50
5.8e+3± 8.5e+2 nM
Comments
extracted
Citation
 Maibaum, JLiao, SMVulpetti, AOstermann, NRandl, SRüdisser, SLorthiois, EErbel, PKinzel, BKolb, FABarbieri, SWagner, JDurand, CFettis, KDussauge, SHughes, NDelgado, OHommel, UGould, TMac Sweeney, AGerhartz, BCumin, FFlohr, SSchubart, AJaffee, BHarrison, RRisitano, AMEder, JAnderson, K Small-molecule factor D inhibitors targeting the alternative complement pathway. Nat Chem Biol 12:1105-1110 (2016)  
Target
Name:
Complement factor D [24-253]
Synonyms:
CFAD_HUMAN Complement factor D (FD) catalytic domain (Human fD) PFD
Type:
Protein
Mol. Mass.:
24622.79
Organism:
Homo sapiens (Human)
Description:
P00746 (24-253 aa)
Residue:
230
  
Inhibitor
Name:
BDBM203868
Synonyms:
(S)-N2-benzhydryl-N1-(1-methyl-1H-indol-3-yl)pyrrolidine-1,2-dicarboxamide (5)
Type:
Small organic molecule
Emp. Form.:
C28H28N4O2
Mol. Mass.:
452.5475
SMILES:
Cn1cc(NC(=O)N2CCC[C@H]2C(=O)NC(c2ccccc2)c2ccccc2)c2ccccc12
: