Target
Kallikrein-7 [37-253,Y180R]
Ligand
BDBM203864
Substrate
Meas. Tech.
Human KLK7 Fluorescence-Lifetime Assay
pH
5.6±n/a
Temperature
298.15±n/a K
IC50
7e+2± 2e+2 nM
Comments
extracted
Citation
 Maibaum, JLiao, SMVulpetti, AOstermann, NRandl, SRüdisser, SLorthiois, EErbel, PKinzel, BKolb, FABarbieri, SWagner, JDurand, CFettis, KDussauge, SHughes, NDelgado, OHommel, UGould, TMac Sweeney, AGerhartz, BCumin, FFlohr, SSchubart, AJaffee, BHarrison, RRisitano, AMEder, JAnderson, K Small-molecule factor D inhibitors targeting the alternative complement pathway. Nat Chem Biol 12:1105-1110 (2016)  
Target
Name:
Kallikrein-7 [37-253,Y180R]
Synonyms:
KLK7 Kalligrein-7 Y180R (KLK7) SCCE
Type:
Protein
Mol. Mass.:
23785.70
Organism:
Homo sapiens (Human)
Description:
P49862 (37-253 aa with Y180R mutation)
Residue:
217
  
Inhibitor
Name:
BDBM203864
Synonyms:
(S)-N2-(4-methoxyphenethyl)-N1-(naphthalen-1-ylmethyl)pyrrolidine-1,2-dicarboxamide (1)
Type:
Small organic molecule
Emp. Form.:
C26H29N3O3
Mol. Mass.:
431.5268
SMILES:
COc1ccc(CCNC(=O)[C@@H]2CCCN2C(=O)NCc2cccc3ccccc23)cc1
: