Target
Mitogen-activated protein kinase 1
Ligand
BDBM204471
Substrate
Meas. Tech.
ERK2 (20 pM) Kinase Assay
pH
7.5±n/a
IC50
0.0119±n/a nM
Comments
extracted
Citation
 Bagdanoff, JTDing, YHan, WHuang, ZJiang, QJin, JXKou, XLee, PLindvall, MMin, ZPan, YPecchi, SPfister, KBPoon, DRauniyar, VWang, XMZhang, QZhou, JZhu, S Aminoheteroaryl benzamides as kinase inhibitors US Patent  US9242996 Publication Date 1/26/2016 
Target
Name:
Mitogen-activated protein kinase 1
Synonyms:
ERK2 Extracellular signal-regulated kinase 2 Extracellular signal-regulated kinase 2 (ERK2) MAPK 2 MK01_HUMAN Mitogen-activated protein kinase 1 (ERK-2) Mitogen-activated protein kinase 2 PRKM2 | p42-MAPK
Type:
Ser/Thr Protein Kinase
Mol. Mass.:
41392.76
Organism:
Homo sapiens (Human)
Description:
P28482
Residue:
360
  
Inhibitor
Name:
BDBM204471
Synonyms:
US9242996, 181
Type:
Small organic molecule
Emp. Form.:
C24H24ClF2N5O2
Mol. Mass.:
487.929
SMILES:
NC[C@@H](NC(=O)c1ccc(cc1F)-c1nc(cnc1N)C1CCOCC1)c1cc(F)cc(Cl)c1
: