Target
Genome polyprotein
Ligand
BDBM204540
Substrate
Meas. Tech.
Inhbition Assay
IC50
29±n/a nM
Citation
 He, SDai, XPalani, ANargund, RLai, ZZorn, NXiao, DDang, QMcComas, CCLi, PPeng, XSoll, R Tetracyclic heterocycle compounds and methods of use thereof for the treatment of hepatitis C US Patent  US9242998 Publication Date 1/26/2016 
Target
Name:
Genome polyprotein
Synonyms:
HCV Polymerase (S282T) NS3/4A Protein POLG_HCVJA
Type:
Protein
Mol. Mass.:
327076.78
Organism:
Hepatitis C Virus (Virus)
Description:
P26662
Residue:
3010
  
Inhibitor
Name:
BDBM204540
Synonyms:
US9242998, 18
Type:
Small organic molecule
Emp. Form.:
C32H26FN5O6S
Mol. Mass.:
627.642
SMILES:
CNC(=O)c1c(oc2cc(N(C)S(C)(=O)=O)c(cc12)-c1ccc2OCn3c(cc4c(F)cccc34)-c2n1)-c1ccn(C)c(=O)c1
: